Target
5-hydroxytryptamine receptor 2A
Ligand
BDBM50457575
Substrate
Meas. Tech.
ChEMBL_1760116 (CHEMBL4195124)
Ki
192±n/a nM
Citation
 Pa?czyk, KPytka, KJakubczyk, MRapacz, ASa?at, KFurga?a, ASiwek, AG?uch-Lutwin, MGrybo?, AS?oczy?ska, KP?kala, E?mudzki, PBucki, AKo?aczkowski, M?elaszczyk, DMarona, HWaszkielewicz, AM Synthesis and activity of di- or trisubstituted N-(phenoxyalkyl)- or N-{2-[2-(phenoxy)ethoxy]ethyl}piperazine derivatives on the central nervous system. Bioorg Med Chem Lett 28:2039-2049 (2018)  
Target
Name:
5-hydroxytryptamine receptor 2A
Synonyms:
5-HT-2 5-HT2A 5-hydroxytryptamine receptor 2A (5HT-2A) 5HT2A_HUMAN HTR2A | Serotonin receptor 2A
Type:
undefined
Mol. Mass.:
52607.65
Organism:
Homo sapiens (Human)
Description:
P28223
Residue:
471
  
Inhibitor
Name:
BDBM50457575
Synonyms:
CHEMBL3979261
Type:
Small organic molecule
Emp. Form.:
C22H31ClN2O2
Mol. Mass.:
390.947
SMILES:
Cl.COc1ccccc1N1CCN(CCCOc2c(C)cccc2C)CC1
: