Target
Protease
Ligand
BDBM50457608
Substrate
Meas. Tech.
ChEMBL_1760346 (CHEMBL4195354)
Ki
0.010000±n/a nM
Citation
 Ghosh, AKR Nyalapatla, PKovela, SRao, KVBrindisi, MOsswald, HLAmano, MAoki, MAgniswamy, JWang, YFWeber, ITMitsuya, H Design and Synthesis of Highly Potent HIV-1 Protease Inhibitors Containing Tricyclic Fused Ring Systems as Novel P2 Ligands: Structure-Activity Studies, Biological and X-ray Structural Analysis. J Med Chem 61:4561-4577 (2018)  
Target
Name:
Protease
Synonyms:
Type:
Enzyme
Mol. Mass.:
10904.79
Organism:
Human immunodeficiency virus 1 (HIV-1)
Description:
Q9YQ12
Residue:
99
  
Inhibitor
Name:
BDBM50457608
Synonyms:
CHEMBL4211505
Type:
Small organic molecule
Emp. Form.:
C34H44N4O7S2
Mol. Mass.:
684.866
SMILES:
[H][C@]12OCC3C[C@H](OC(=O)N[C@@H](Cc4ccccc4)[C@H](O)CN(CC(C)C)S(=O)(=O)c4ccc5nc(NC6CC6)sc5c4)[C@]([H])(CCO1)[C@]23[H]
: