Target
Cytochrome P450 3A5
Ligand
BDBM50457699
Substrate
Meas. Tech.
ChEMBL_1760541 (CHEMBL4195549)
IC50
>10000±n/a nM
Citation
 Santora, VJAlmos, TABarido, RBasinger, JBellows, CLBookser, BCBreitenbucher, JGBroadbent, NJCabebe, CChai, CKChen, MChow, SChung, MCrickard, LDanks, AMFreestone, GCGitnick, DGupta, VHoffmaster, CHudson, ARKaplan, APKennedy, MRLee, DLimberis, JLy, KMak, CCMasatsugu, BMorse, ACNa, JNeul, DNikpur, JPeters, MPetroski, RERenick, JSebring, KSevidal, STabatabaei, AWen, JYan, YYoder, ZWZook, D Design and Synthesis of Novel and Selective Glycine Transporter-1 (GlyT1) Inhibitors with Memory Enhancing Properties. J Med Chem 61:6018-6033 (2018)  
Target
Name:
Cytochrome P450 3A5
Synonyms:
CP3A5_HUMAN Cytochrome P450 3A5 | Cytochrome P450 3A5 (CYP3A5)
Type:
Protein
Mol. Mass.:
57118.00
Organism:
Homo sapiens (Human)
Description:
P20815
Residue:
502
  
Inhibitor
Name:
BDBM50457699
Synonyms:
CHEMBL4210095
Type:
Small organic molecule
Emp. Form.:
C21H21F3N4O2
Mol. Mass.:
418.4122
SMILES:
C[C@H](Oc1ccc(cc1C(=O)N1Cc2cn(nc2C1)C1CCCC1)C#N)C(F)(F)F
: