Target
Cytochrome P450 3A5
Ligand
BDBM50457692
Substrate
Meas. Tech.
ChEMBL_1760541 (CHEMBL4195549)
IC50
>10000±n/a nM
Citation
 Santora, VJAlmos, TABarido, RBasinger, JBellows, CLBookser, BCBreitenbucher, JGBroadbent, NJCabebe, CChai, CKChen, MChow, SChung, MCrickard, LDanks, AMFreestone, GCGitnick, DGupta, VHoffmaster, CHudson, ARKaplan, APKennedy, MRLee, DLimberis, JLy, KMak, CCMasatsugu, BMorse, ACNa, JNeul, DNikpur, JPeters, MPetroski, RERenick, JSebring, KSevidal, STabatabaei, AWen, JYan, YYoder, ZWZook, D Design and Synthesis of Novel and Selective Glycine Transporter-1 (GlyT1) Inhibitors with Memory Enhancing Properties. J Med Chem 61:6018-6033 (2018)  
Target
Name:
Cytochrome P450 3A5
Synonyms:
CP3A5_HUMAN Cytochrome P450 3A5 | Cytochrome P450 3A5 (CYP3A5)
Type:
Protein
Mol. Mass.:
57118.00
Organism:
Homo sapiens (Human)
Description:
P20815
Residue:
502
  
Inhibitor
Name:
BDBM50457692
Synonyms:
CHEMBL4211012
Type:
Small organic molecule
Emp. Form.:
C22H19F4N3O4S
Mol. Mass.:
497.463
SMILES:
C[C@H](Oc1ccc(cc1C(=O)N1Cc2cn(nc2C1)-c1ccccc1F)S(C)(=O)=O)C(F)(F)F
: