Target
Serine/threonine-protein kinase ULK1
Ligand
BDBM50458506
Substrate
Meas. Tech.
ChEMBL_1763987 (CHEMBL4199234)
EC50
41±n/a nM
Citation
 Ouyang, LZhang, LZhang, SYao, DZhao, YWang, GFu, LLei, PLiu, B Small-Molecule Activator of UNC-51-Like Kinase 1 (ULK1) That Induces Cytoprotective Autophagy for Parkinson's Disease Treatment. J Med Chem 61:2776-2792 (2018)  
Target
Name:
Serine/threonine-protein kinase ULK1
Synonyms:
ATG1 KIAA0722 ULK1_HUMAN hATG1
Type:
PROTEIN
Mol. Mass.:
112661.80
Organism:
Homo sapiens (Human)
Description:
ChEMBL_1510275
Residue:
1050
  
Inhibitor
Name:
BDBM50458506
Synonyms:
CHEMBL4210617
Type:
Small organic molecule
Emp. Form.:
C22H19F3N2O
Mol. Mass.:
384.3943
SMILES:
Fc1ccc(CCN[C@@H](C(=O)Nc2ccc(F)cc2F)c2ccccc2)cc1
: