Target
5-hydroxytryptamine receptor 7
Ligand
BDBM50458558
Substrate
Meas. Tech.
ChEMBL_1764147 (CHEMBL4199394)
EC50
165±n/a nM
Citation
 Kim, YKim, HLee, JLee, JKMin, SJSeong, JRhim, HTae, JLee, HJChoo, H Discovery of ?-Arrestin Biased Ligands of 5-HT J Med Chem 61:7218-7233 (2018)  
Target
Name:
5-hydroxytryptamine receptor 7
Synonyms:
5-HT-7 5-HT7 5-HT7S 5HT7 HTR7 | Serotonin receptor 7
Type:
G Protein-Coupled Receptor (GPCR)
Mol. Mass.:
53573.08
Organism:
Homo sapiens (Human)
Description:
P34969
Residue:
479
  
Inhibitor
Name:
BDBM50458558
Synonyms:
CHEMBL4210782
Type:
Small organic molecule
Emp. Form.:
C14H17N3
Mol. Mass.:
227.3049
SMILES:
Cc1ccc(cc1)-c1n[nH]c2CCNCCc12
: