Target
5-hydroxytryptamine receptor 2C
Ligand
BDBM50458550
Substrate
Meas. Tech.
ChEMBL_1764108 (CHEMBL4199355)
Ki
200±n/a nM
Citation
 Kim, YKim, HLee, JLee, JKMin, SJSeong, JRhim, HTae, JLee, HJChoo, H Discovery of ?-Arrestin Biased Ligands of 5-HT J Med Chem 61:7218-7233 (2018)  
Target
Name:
5-hydroxytryptamine receptor 2C
Synonyms:
5-HT-1C 5-HT1C 5-HT2C-INI 5-HTR2C 5-hydroxytryptamine receptor 2C (5-HT-2C) 5HT-1C HTR1C Serotonin (5-HT3) receptor Serotonin Receptor 2C
Type:
G Protein-Coupled Receptor (GPCR)
Mol. Mass.:
51836.79
Organism:
Homo sapiens (Human)
Description:
P28335
Residue:
458
  
Inhibitor
Name:
BDBM50458550
Synonyms:
CHEMBL4209274
Type:
Small organic molecule
Emp. Form.:
C13H14FN3
Mol. Mass.:
231.2688
SMILES:
Fc1ccc(cc1)-c1n[nH]c2CCNCCc12
: