Target
5-hydroxytryptamine receptor 5A
Ligand
BDBM50458550
Substrate
Meas. Tech.
ChEMBL_1764111 (CHEMBL4199358)
Ki
>10000±n/a nM
Citation
 Kim, YKim, HLee, JLee, JKMin, SJSeong, JRhim, HTae, JLee, HJChoo, H Discovery of ?-Arrestin Biased Ligands of 5-HT J Med Chem 61:7218-7233 (2018)  
Target
Name:
5-hydroxytryptamine receptor 5A
Synonyms:
5-HT-5 5-hydroxytryptamine receptor 5 (5-HT5) 5HT5A_HUMAN Serotonin (5-HT) receptor | Serotonin receptor 5A
Type:
Enzyme
Mol. Mass.:
40266.25
Organism:
Homo sapiens (Human)
Description:
P47898
Residue:
357
  
Inhibitor
Name:
BDBM50458550
Synonyms:
CHEMBL4209274
Type:
Small organic molecule
Emp. Form.:
C13H14FN3
Mol. Mass.:
231.2688
SMILES:
Fc1ccc(cc1)-c1n[nH]c2CCNCCc12
: