Target
5-hydroxytryptamine receptor 1B
Ligand
BDBM50458550
Substrate
Meas. Tech.
ChEMBL_1764103 (CHEMBL4199350)
Ki
>10000±n/a nM
Citation
 Kim, YKim, HLee, JLee, JKMin, SJSeong, JRhim, HTae, JLee, HJChoo, H Discovery of ?-Arrestin Biased Ligands of 5-HT J Med Chem 61:7218-7233 (2018)  
Target
Name:
5-hydroxytryptamine receptor 1B
Synonyms:
5-HT-1B 5-HT1B 5HT1B_HUMAN HTR1DB Serotonin (5-HT) receptor Serotonin Receptor 1B
Type:
G Protein-Coupled Receptor (GPCR)
Mol. Mass.:
43579.17
Organism:
Homo sapiens (Human)
Description:
Receptor binding assays were performed using human clone stably expressed in CHO cells
Residue:
390
  
Inhibitor
Name:
BDBM50458550
Synonyms:
CHEMBL4209274
Type:
Small organic molecule
Emp. Form.:
C13H14FN3
Mol. Mass.:
231.2688
SMILES:
Fc1ccc(cc1)-c1n[nH]c2CCNCCc12
: