Target
Tyrosine-protein kinase TXK
Ligand
BDBM50458597
Substrate
Meas. Tech.
ChEMBL_1764257 (CHEMBL4199504)
IC50
0.180000±n/a nM
Citation
 Blass, BE Covalent Inhibitors of the TEC Family of Kinases and Their Methods of Use. ACS Med Chem Lett 9:587-589 (2018)  
Target
Name:
Tyrosine-protein kinase TXK
Synonyms:
PTK4 RLK TXK Tyrosine-protein kinase TXK (TXK)
Type:
Protein
Mol. Mass.:
61268.80
Organism:
Homo sapiens (Human)
Description:
P42681
Residue:
527
  
Inhibitor
Name:
BDBM50458597
Synonyms:
CHEMBL4203077 | US10752615, Compound 4
Type:
Small organic molecule
Emp. Form.:
C32H38N6O3S
Mol. Mass.:
586.748
SMILES:
C[C@H](NCc1ccc2n([C@H]3C[C@]4(C3)CCN(C4)C(=O)C=C)c(NC(=O)c3ccc(s3)-c3cnco3)nc2c1)C(C)(C)C
: