Target
Tyrosine-protein kinase TXK
Ligand
BDBM50458600
Substrate
Meas. Tech.
ChEMBL_1764257 (CHEMBL4199504)
IC50
0.140000±n/a nM
Citation
 Blass, BE Covalent Inhibitors of the TEC Family of Kinases and Their Methods of Use. ACS Med Chem Lett 9:587-589 (2018)  
Target
Name:
Tyrosine-protein kinase TXK
Synonyms:
PTK4 RLK TXK Tyrosine-protein kinase TXK (TXK)
Type:
Protein
Mol. Mass.:
61268.80
Organism:
Homo sapiens (Human)
Description:
P42681
Residue:
527
  
Inhibitor
Name:
BDBM50458600
Synonyms:
CHEMBL4206765 | US10752615, Compound 97
Type:
Small organic molecule
Emp. Form.:
C27H25N5O3S
Mol. Mass.:
499.584
SMILES:
C=CC(=O)N1CC[C@@]2(C[C@@H](C2)n2c(NC(=O)c3ccc(s3)-c3cc[nH]c(=O)c3)nc3ccccc23)C1
: