Target
Tyrosine-protein kinase TXK
Ligand
BDBM50458603
Substrate
Meas. Tech.
ChEMBL_1764257 (CHEMBL4199504)
IC50
0.320000±n/a nM
Citation
 Blass, BE Covalent Inhibitors of the TEC Family of Kinases and Their Methods of Use. ACS Med Chem Lett 9:587-589 (2018)  
Target
Name:
Tyrosine-protein kinase TXK
Synonyms:
PTK4 RLK TXK Tyrosine-protein kinase TXK (TXK)
Type:
Protein
Mol. Mass.:
61268.80
Organism:
Homo sapiens (Human)
Description:
P42681
Residue:
527
  
Inhibitor
Name:
BDBM50458603
Synonyms:
CHEMBL4216529 | US10752615, Compound 42
Type:
Small organic molecule
Emp. Form.:
C32H36N6O4S
Mol. Mass.:
600.731
SMILES:
O[C@H]1CC[C@@H](CC1)NCc1ccc2n([C@H]3C[C@]4(C3)CCN(C4)C(=O)C=C)c(NC(=O)c3ccc(s3)-c3cnco3)nc2c1
: