Target
Tyrosine-protein kinase TXK
Ligand
BDBM50458593
Substrate
Meas. Tech.
ChEMBL_1764257 (CHEMBL4199504)
IC50
0.290000±n/a nM
Citation
 Blass, BE Covalent Inhibitors of the TEC Family of Kinases and Their Methods of Use. ACS Med Chem Lett 9:587-589 (2018)  
Target
Name:
Tyrosine-protein kinase TXK
Synonyms:
PTK4 RLK TXK Tyrosine-protein kinase TXK (TXK)
Type:
Protein
Mol. Mass.:
61268.80
Organism:
Homo sapiens (Human)
Description:
P42681
Residue:
527
  
Inhibitor
Name:
BDBM50458593
Synonyms:
CHEMBL4204572 | US10752615, Compound 30
Type:
Small organic molecule
Emp. Form.:
C24H24F2N4O2S
Mol. Mass.:
470.535
SMILES:
CC(F)(F)c1ccc(s1)C(=O)Nc1nc2ccccc2n1[C@H]1C[C@]2(C1)CCN(C2)C(=O)C=C
: