Target
Group 10 secretory phospholipase A2
Ligand
BDBM50366784
Substrate
Meas. Tech.
ChEMBL_1764262 (CHEMBL4199509)
IC50
26±n/a nM
Target
Name:
Group 10 secretory phospholipase A2
Synonyms:
Group X secretory phospholipase A2 PLA2G10
Type:
PROTEIN
Mol. Mass.:
18153.11
Organism:
Homo sapiens (Human)
Description:
ChEMBL_1442449
Residue:
165
  
Inhibitor
Name:
BDBM50366784
Synonyms:
CHEMBL4171084
Type:
Small organic molecule
Emp. Form.:
C19H15F3N2O4
Mol. Mass.:
392.3286
SMILES:
NC(=O)c1cc2ccc(OC(F)(F)F)cc2n1-c1cccc(CCC(O)=O)c1
: