Target
Group 10 secretory phospholipase A2
Ligand
BDBM50458613
Substrate
Meas. Tech.
ChEMBL_1764262 (CHEMBL4199509)
IC50
39±n/a nM
Target
Name:
Group 10 secretory phospholipase A2
Synonyms:
Group X secretory phospholipase A2 PLA2G10
Type:
PROTEIN
Mol. Mass.:
18153.11
Organism:
Homo sapiens (Human)
Description:
ChEMBL_1442449
Residue:
165
  
Inhibitor
Name:
BDBM50458613
Synonyms:
CHEMBL4204172
Type:
Small organic molecule
Emp. Form.:
C20H17F3N2O5
Mol. Mass.:
422.3546
SMILES:
COC(Cc1cccc(c1)-n1c(cc2ccc(OC(F)(F)F)cc12)C(N)=O)C(O)=O
: