Target
Group 10 secretory phospholipase A2
Ligand
BDBM50458617
Substrate
Meas. Tech.
ChEMBL_1764262 (CHEMBL4199509)
IC50
14±n/a nM
Target
Name:
Group 10 secretory phospholipase A2
Synonyms:
Group X secretory phospholipase A2 PLA2G10
Type:
PROTEIN
Mol. Mass.:
18153.11
Organism:
Homo sapiens (Human)
Description:
ChEMBL_1442449
Residue:
165
  
Inhibitor
Name:
BDBM50458617
Synonyms:
CHEMBL4215835
Type:
Small organic molecule
Emp. Form.:
C19H16F3N3O4
Mol. Mass.:
407.3432
SMILES:
CC(CC(O)=O)c1cccc(n1)-n1c(cc2ccc(OC(F)(F)F)cc12)C(N)=O
: