Target
Gap junction beta-2 protein
Ligand
BDBM50458730
Substrate
Meas. Tech.
ChEMBL_1764537 (CHEMBL4199784)
IC50
19000±n/a nM
Citation
 AlFindee, MNSubedi, YPFiori, MCKrishnan, SKjellgren, AAltenberg, GAChang, CT Inhibition of Connexin Hemichannels by New Amphiphilic Aminoglycosides without Antibiotic Activity. ACS Med Chem Lett 9:697-701 (2018)  
Target
Name:
Gap junction beta-2 protein
Synonyms:
CXB2_HUMAN Cx26 Gap junction beta-2 protein
Type:
PROTEIN
Mol. Mass.:
26226.37
Organism:
Homo sapiens
Description:
ChEMBL_117983
Residue:
226
  
Inhibitor
Name:
BDBM50458730
Synonyms:
CHEMBL4206024
Type:
Small organic molecule
Emp. Form.:
C26H52N4O11
Mol. Mass.:
596.7113
SMILES:
[H][C@@]1(O[C@H]2[C@H](N)C[C@H](N)[C@@H](O[C@@]3([H])O[C@H](CN)[C@@H](O)[C@H](O)[C@H]3O)[C@@H]2O)O[C@H](COCCCC)[C@@H](OCCCC)[C@H](N)[C@H]1O
: