Target
Urokinase-type plasminogen activator
Ligand
BDBM50459059
Substrate
Meas. Tech.
ChEMBL_1765385 (CHEMBL4200632)
Ki
1611±n/a nM
Citation
 Buckley, BJAboelela, AMinaei, EJiang, LXXu, ZAli, UFildes, KCheung, CYCook, SMJohnson, DCBachovchin, DACook, GMApte, MHuang, MRanson, MKelso, MJ 6-Substituted Hexamethylene Amiloride (HMA) Derivatives as Potent and Selective Inhibitors of the Human Urokinase Plasminogen Activator for Use in Cancer. J Med Chem 61:8299-8320 (2018)  
Target
Name:
Urokinase-type plasminogen activator
Synonyms:
Plau Urokinase-type plasminogen activator (uPA)
Type:
Enzyme
Mol. Mass.:
48282.52
Organism:
Mus musculus (Mouse)
Description:
P06869
Residue:
433
  
Inhibitor
Name:
BDBM50459059
Synonyms:
CHEMBL4217043
Type:
Small organic molecule
Emp. Form.:
C17H23N9O2
Mol. Mass.:
385.4236
SMILES:
COc1ncc(cn1)-c1nc(C(=O)NC(N)=N)c(N)nc1N1CCCCCC1
: