Target
Urokinase-type plasminogen activator
Ligand
BDBM50459055
Substrate
Meas. Tech.
ChEMBL_1765363 (CHEMBL4200610)
Ki
88±n/a nM
Citation
 Buckley, BJAboelela, AMinaei, EJiang, LXXu, ZAli, UFildes, KCheung, CYCook, SMJohnson, DCBachovchin, DACook, GMApte, MHuang, MRanson, MKelso, MJ 6-Substituted Hexamethylene Amiloride (HMA) Derivatives as Potent and Selective Inhibitors of the Human Urokinase Plasminogen Activator for Use in Cancer. J Med Chem 61:8299-8320 (2018)  
Target
Name:
Urokinase-type plasminogen activator
Synonyms:
3.4.21.73 U-plasminogen activator Urokinase Urokinase-type plasminogen activator chain B Urokinase-type plasminogen activator short chain A uPA
Type:
Enzyme
Mol. Mass.:
48528.62
Organism:
Homo sapiens (Human)
Description:
P00749
Residue:
431
  
Inhibitor
Name:
BDBM50459055
Synonyms:
CHEMBL4207715
Type:
Small organic molecule
Emp. Form.:
C20H22FN7O2
Mol. Mass.:
411.4328
SMILES:
NC(=N)NC(=O)c1nc(-c2cc3c(F)cccc3o2)c(nc1N)N1CCCCCC1
: