Target
Urokinase-type plasminogen activator
Ligand
BDBM16173
Substrate
Meas. Tech.
ChEMBL_1765385 (CHEMBL4200632)
Ki
2313±n/a nM
Citation
 Buckley, BJAboelela, AMinaei, EJiang, LXXu, ZAli, UFildes, KCheung, CYCook, SMJohnson, DCBachovchin, DACook, GMApte, MHuang, MRanson, MKelso, MJ 6-Substituted Hexamethylene Amiloride (HMA) Derivatives as Potent and Selective Inhibitors of the Human Urokinase Plasminogen Activator for Use in Cancer. J Med Chem 61:8299-8320 (2018)  
Target
Name:
Urokinase-type plasminogen activator
Synonyms:
Plau Urokinase-type plasminogen activator (uPA)
Type:
Enzyme
Mol. Mass.:
48282.52
Organism:
Mus musculus (Mouse)
Description:
P06869
Residue:
433
  
Inhibitor
Name:
BDBM16173
Synonyms:
3,5-diamino-6-chloro-N-(diaminomethylene)pyrazinamide;hydrochloride Amiloride CHEMBL945
Type:
Small organic molecule
Emp. Form.:
C6H8ClN7O
Mol. Mass.:
229.627
SMILES:
NC(=N)NC(=O)c1nc(Cl)c(N)nc1N
: