Target
Cannabinoid receptor 1
Ligand
BDBM22988
Substrate
Meas. Tech.
ChEMBL_1766240 (CHEMBL4201487)
Ki
74±n/a nM
Citation
 Liu, YJi, LEno, MKudalkar, SLi, ALSchimpgen, MBenchama, OMorales, PXu, SHurst, DWu, SMohammad, KAWood, JTZvonok, NPapahatjis, DPZhou, HHonrao, CMackie, KReggio, PHohmann, AGMarnett, LJMakriyannis, ANikas, SP ( R)- N-(1-Methyl-2-hydroxyethyl)-13-( S)-methyl-arachidonamide (AMG315): A Novel Chiral Potent Endocannabinoid Ligand with Stability to Metabolizing Enzymes. J Med Chem 61:8639-8657 (2018)  
Target
Name:
Cannabinoid receptor 1
Synonyms:
Brain-type cannabinoid receptor CB-R CNR1_RAT Cannabinoid receptor Cnr1 | Skr6
Type:
G Protein-Coupled Receptor (GPCR)
Mol. Mass.:
52856.55
Organism:
Rattus norvegicus (rat)
Description:
P20272
Residue:
473
  
Inhibitor
Name:
BDBM22988
Synonyms:
(5Z,8Z,11Z,14Z)-N-(2-hydroxyethyl)icosa-5,8,11,14-tetraenamide ANANDAMIDE Arachidonoyl ethanolamide (AEA) Arachidonylethanolamide [14C]Anandamide | [3H]Anandamide
Type:
radiolabeled substrate
Emp. Form.:
C22H37NO2
Mol. Mass.:
347.5347
SMILES:
CCCCC\C=C/C\C=C/C\C=C/C\C=C/CCCC(=O)NCCO
: