Target
5-hydroxytryptamine receptor 2C
Ligand
BDBM50459707
Substrate
Meas. Tech.
ChEMBL_1766967 (CHEMBL4202214)
EC50
0.190±n/a nM
Citation
 Kargbo, RB 5-HT ACS Med Chem Lett 9:864-865 (2018)  
Target
Name:
5-hydroxytryptamine receptor 2C
Synonyms:
5-HT-1C 5-HT1C 5-HT2C-INI 5-HTR2C 5-hydroxytryptamine receptor 2C (5-HT-2C) 5HT-1C HTR1C Serotonin (5-HT3) receptor Serotonin Receptor 2C
Type:
G Protein-Coupled Receptor (GPCR)
Mol. Mass.:
51836.79
Organism:
Homo sapiens (Human)
Description:
P28335
Residue:
458
  
Inhibitor
Name:
BDBM50459707
Synonyms:
CHEMBL4208452 | US10836764, Compound 115
Type:
Small organic molecule
Emp. Form.:
C18H20FN3
Mol. Mass.:
297.3699
SMILES:
[H][C@]12CCc3c(Cc4cccc(F)c4)ccnc3N1CCNC2
: