Target
5-hydroxytryptamine receptor 2C
Ligand
BDBM50459712
Substrate
Meas. Tech.
ChEMBL_1766967 (CHEMBL4202214)
EC50
1.2±n/a nM
Citation
 Kargbo, RB 5-HT ACS Med Chem Lett 9:864-865 (2018)  
Target
Name:
5-hydroxytryptamine receptor 2C
Synonyms:
5-HT-1C 5-HT1C 5-HT2C-INI 5-HTR2C 5-hydroxytryptamine receptor 2C (5-HT-2C) 5HT-1C HTR1C Serotonin (5-HT3) receptor Serotonin Receptor 2C
Type:
G Protein-Coupled Receptor (GPCR)
Mol. Mass.:
51836.79
Organism:
Homo sapiens (Human)
Description:
P28335
Residue:
458
  
Inhibitor
Name:
BDBM50459712
Synonyms:
CHEMBL4218374 | US10836764, Compound 173
Type:
Small organic molecule
Emp. Form.:
C14H21N3
Mol. Mass.:
231.3366
SMILES:
[H][C@]12CCc3c(CCC)cncc3N1CCNC2
: