Target
CREB-binding protein
Ligand
BDBM50459793
Substrate
Meas. Tech.
ChEMBL_1767073 (CHEMBL4202320)
IC50
19±n/a nM
Citation
 Zhu, JDong, JBatiste, LUnzue, ADolbois, APascanu, V?led?, PNevado, CCaflisch, A Binding Motifs in the CBP Bromodomain: An Analysis of 20 Crystal Structures of Complexes with Small Molecules. ACS Med Chem Lett 9:929-934 (2018)  
Target
Name:
CREB-binding protein
Synonyms:
CBP CREB-binding protein (CBP) CREBBP
Type:
Transcription Coactivator
Mol. Mass.:
265411.66
Organism:
Homo sapiens (Human)
Description:
Q92793
Residue:
2442
  
Inhibitor
Name:
BDBM50459793
Synonyms:
CHEMBL4205572
Type:
Small organic molecule
Emp. Form.:
C24H23N3O6
Mol. Mass.:
449.4559
SMILES:
CCOc1ccc(cc1NC(=O)c1cc(NC(C)=O)cc(NC(=O)c2ccco2)c1)C(C)=O
: