Target
Bromodomain-containing protein 3
Ligand
BDBM50459819
Substrate
Meas. Tech.
ChEMBL_1767167 (CHEMBL4219279)
IC50
1.9±n/a nM
Citation
 Zhou, BHu, JXu, FChen, ZBai, LFernandez-Salas, ELin, MLiu, LYang, CYZhao, YMcEachern, DPrzybranowski, SWen, BSun, DWang, S Discovery of a Small-Molecule Degrader of Bromodomain and Extra-Terminal (BET) Proteins with Picomolar Cellular Potencies and Capable of Achieving Tumor Regression. J Med Chem 61:462-481 (2018)  
Target
Name:
Bromodomain-containing protein 3
Synonyms:
BRD3 Bromodomain and extra-terminal motif (BET) Bromodomain-containing protein 3 (BRD3) RING3-like protein | RING3L
Type:
Protein
Mol. Mass.:
79571.81
Organism:
Homo sapiens (Human)
Description:
Q15059
Residue:
726
  
Inhibitor
Name:
BDBM50459819
Synonyms:
CHEMBL4228445
Type:
Small organic molecule
Emp. Form.:
C26H28N8O3
Mol. Mass.:
500.5523
SMILES:
CCn1nc(cc1Nc1nc(nc2[nH]c3cc(-c4c(C)noc4C)c(OC)cc3c12)C(=O)NC)C1CC1
: