Target
Gamma-aminobutyric acid receptor subunit alpha-5/beta-3/gamma-2
Ligand
BDBM50459892
Substrate
Meas. Tech.
ChEMBL_1767482 (CHEMBL4219594)
Ki
55±n/a nM
Citation
 Sparling, BADiMauro, EF Progress in the discovery of small molecule modulators of the Cys-loop superfamily receptors. Bioorg Med Chem Lett 27:3207-3218 (2017)  
Target
Name:
Gamma-aminobutyric acid receptor subunit alpha-5/beta-3/gamma-2
Synonyms:
GABA A receptor alpha-5/beta-3/gamma-2 | GABA receptor alpha-5/beta-3/gamma-2 subunit
Type:
Mol. Mass.:
Description:
ASSAY_ID of EBI is 70706
Components:
This complex has 3 components.
Component 1
Name:
Gamma-aminobutyric acid receptor subunit gamma-2
Synonyms:
GBRG2_RAT Gamma-aminobutyric acid receptor subunit gamma-2 (GABA(A) gamma-2)
Type:
Enzyme
Mol. Mass.:
54087.63
Organism:
Rattus norvegicus (Rat)
Description:
P18508
Residue:
466
  
Component 2
Name:
Gamma-aminobutyric acid receptor subunit alpha-5
Synonyms:
GABA A Alpha5Beta2Gamma2 GABA A Alpha5m10Beta2Gamma2 GABA A Alpha5m9Beta2Gamma2 GABA A receptor alpha-5/beta-3/gamma-2 GBRA5_RAT Gabra5 | Gamma-aminobutyric acid receptor subunit alpha-5
Type:
Enzyme Catalytic Domain
Mol. Mass.:
52350.79
Organism:
RAT
Description:
GABA A alpha5 0 RAT::P19969
Residue:
464
  
Component 3
Name:
Gamma-aminobutyric acid receptor subunit beta-3
Synonyms:
GABA receptor beta-3 subunit Gabrb-3 | Gabrb3
Type:
PROTEIN
Mol. Mass.:
54180.66
Organism:
Rattus norvegicus
Description:
EBI_12481
Residue:
473
  
Inhibitor
Name:
BDBM50459892
Synonyms:
CHEMBL4228824
Type:
Small organic molecule
Emp. Form.:
C22H17FN4O
Mol. Mass.:
372.395
SMILES:
CNC(=O)c1ncn-2c1[C@@H](C)N=C(c1ccccc1F)c1cc(ccc-21)C#C
: