Target
Cyclin-C/Cyclin-dependent kinase 8
Ligand
BDBM62810
Substrate
Meas. Tech.
ChEMBL_1768134 (CHEMBL4220246)
EC50
1400±n/a nM
Citation
 Philip, SKumarasiri, MTeo, TYu, MWang, S Cyclin-Dependent Kinase 8: A New Hope in Targeted Cancer Therapy? J Med Chem 61:5073-5092 (2018)  
Target
Name:
Cyclin-C/Cyclin-dependent kinase 8
Synonyms:
Cyclin-dependent kinase 8/Cyclin-C
Type:
Mol. Mass.:
Description:
ASSAY_ID of ChEMBL is 1768134
Components:
This complex has 2 components.
Component 1
Name:
Cyclin-dependent kinase 8
Synonyms:
2.7.11.22 CDK8_MOUSE Cell division protein kinase 8 Mediator complex subunit CDK8 | Mediator of RNA polymerase II transcription subunit CDK8
Type:
PROTEIN
Mol. Mass.:
53226.21
Organism:
Mus musculus
Description:
ChEMBL_118299
Residue:
464
  
Component 2
Name:
Cyclin-C
Synonyms:
CCNC_MOUSE Cyclin-C
Type:
PROTEIN
Mol. Mass.:
33242.84
Organism:
Mus musculus
Description:
ChEMBL_118299
Residue:
283
  
Inhibitor
Name:
BDBM62810
Synonyms:
2-amino-6-methyl-4-(3-pyridinyl)-5,6,7,8-tetrahydroquinoline-3-carbonitrile 2-amino-6-methyl-4-pyridin-3-yl-5,6,7,8-tetrahydroquinoline-3-carbonitrile MLS000114823 cid_3835861
Type:
Small organic molecule
Emp. Form.:
C16H16N4
Mol. Mass.:
264.325
SMILES:
CC1CCc2nc(N)c(C#N)c(-c3cccnc3)c2C1
: