Target
Renin
Ligand
BDBM50023037
Substrate
Meas. Tech.
ChEMBL_196099 (CHEMBL804783)
IC50
500±n/a nM
Citation
 Luly, JRYi, NSoderquist, JStein, HCohen, JPerun, TJPlattner, JJ New inhibitors of human renin that contain novel Leu-Val replacements. J Med Chem 30:1609-16 (1987)  
Target
Name:
Renin
Synonyms:
Angiotensinogenase RENI_HUMAN
Type:
Enzyme
Mol. Mass.:
45058.99
Organism:
Homo sapiens (Human)
Description:
Residue:
406
  
Inhibitor
Name:
BDBM50023037
Synonyms:
CHEMBL3144144 | {1-[1-{1-[1-Hydroxy-2-(3-methyl-butane-1-sulfonyl)-ethyl]-3-methyl-butylcarbamoyl}-2-(1H-imidazol-4-yl)-ethylcarbamoyl]-2-phenyl-ethyl}-carbamic acid tert-butyl ester
Type:
Small organic molecule
Emp. Form.:
C32H51N5O7S
Mol. Mass.:
649.842
SMILES:
CC(C)CCS(=O)(=O)C[C@@H](O)[C@@H](CC(C)C)NC(=O)[C@H](Cc1c[nH]cn1)NC(=O)[C@H](Cc1ccccc1)NC(=O)OC(C)(C)C
: