Target
Nuclear receptor ROR-beta
Ligand
BDBM50460724
Substrate
Meas. Tech.
ChEMBL_1770184 (CHEMBL4222296)
IC50
130±n/a nM
Citation
 Patouret, RDoebelin, CGarcia-Ordonez, RDChang, MRRuiz, CCameron, MDGriffin, PRKamenecka, TM Identification of an aminothiazole series of ROR? modulators. Bioorg Med Chem Lett 28:1178-1181 (2018)  
Target
Name:
Nuclear receptor ROR-beta
Synonyms:
NR1F2 Nuclear receptor subfamily 1 group F member 2 RORB_HUMAN Retinoid-related orphan receptor-beta
Type:
PROTEIN
Mol. Mass.:
53227.30
Organism:
Homo sapiens (Human)
Description:
ChEMBL_107979
Residue:
470
  
Inhibitor
Name:
BDBM50460724
Synonyms:
CHEMBL4228640
Type:
Small organic molecule
Emp. Form.:
C18H9F7N2OS
Mol. Mass.:
434.331
SMILES:
Nc1nc(c(s1)C(=O)c1c(F)cccc1C(F)(F)F)-c1cccc(c1)C(F)(F)F
: