Target
Nuclear receptor ROR-beta
Ligand
BDBM50460731
Substrate
Meas. Tech.
ChEMBL_1770184 (CHEMBL4222296)
IC50
59±n/a nM
Citation
 Patouret, RDoebelin, CGarcia-Ordonez, RDChang, MRRuiz, CCameron, MDGriffin, PRKamenecka, TM Identification of an aminothiazole series of ROR? modulators. Bioorg Med Chem Lett 28:1178-1181 (2018)  
Target
Name:
Nuclear receptor ROR-beta
Synonyms:
NR1F2 Nuclear receptor subfamily 1 group F member 2 RORB_HUMAN Retinoid-related orphan receptor-beta
Type:
PROTEIN
Mol. Mass.:
53227.30
Organism:
Homo sapiens (Human)
Description:
ChEMBL_107979
Residue:
470
  
Inhibitor
Name:
BDBM50460731
Synonyms:
CHEMBL4225808
Type:
Small organic molecule
Emp. Form.:
C26H20Cl2N2O4S2
Mol. Mass.:
559.484
SMILES:
CCS(=O)(=O)c1ccc(CC(=O)Nc2nc(c(s2)C(=O)c2ccccc2Cl)-c2ccccc2Cl)cc1
: