Target
Voltage-dependent L-type calcium channel subunit alpha-1F
Ligand
BDBM50461588
Substrate
Meas. Tech.
ChEMBL_1771627 (CHEMBL4223739)
IC50
3600±n/a nM
Citation
 Gonzalez, DArribas, RLViejo, LLajarin-Cuesta, Rde Los Rios, C Substituent effect of N-benzylated gramine derivatives that prevent the PP2A inhibition and dissipate the neuronal Ca Bioorg Med Chem 26:2551-2560 (2018)  
Target
Name:
Voltage-dependent L-type calcium channel subunit alpha-1F
Synonyms:
CAC1F_HUMAN CACNAF1 Voltage-gated calcium channel | Voltage-gated calcium channel subunit alpha Cav1.4
Type:
PROTEIN
Mol. Mass.:
220661.87
Organism:
Homo sapiens (Human)
Description:
ChEMBL_105734
Residue:
1977
  
Inhibitor
Name:
BDBM50461588
Synonyms:
CHEMBL4226864
Type:
Small organic molecule
Emp. Form.:
C23H28N2
Mol. Mass.:
332.4818
SMILES:
Cc1ccc(Cn2cc(CN3CCCCC3)c3cc(C)ccc23)cc1
: