Target
Falcilysin
Ligand
BDBM50461715
Substrate
Meas. Tech.
ChEMBL_1771931 (CHEMBL4224043)
IC50
10000±n/a nM
Citation
 Chance, JPFejzic, HHernandez, OIstvan, ESAndaya, AMaslov, NAispuro, RCrisanto, TNguyen, HVidal, BSerrano, WKuwahara, BPugne Andanado, CGoldberg, DEMallari, JP Development of piperazine-based hydroxamic acid inhibitors against falcilysin, an essential malarial protease. Bioorg Med Chem Lett 28:1846-1848 (2018)  
Target
Name:
Falcilysin
Synonyms:
3.4.24.- | Falcilysin
Type:
PROTEIN
Mol. Mass.:
138868.64
Organism:
Plasmodium falciparum (isolate 3D7)
Description:
ChEMBL_118121
Residue:
1193
  
Inhibitor
Name:
BDBM50461715
Synonyms:
CHEMBL4227719
Type:
Small organic molecule
Emp. Form.:
C19H20BrN3O6S
Mol. Mass.:
498.348
SMILES:
COc1ccc(cc1)S(=O)(=O)N1CCN(CC1C(=O)NO)C(=O)c1cccc(Br)c1
: