Target
Falcilysin
Ligand
BDBM50461719
Substrate
Meas. Tech.
ChEMBL_1771931 (CHEMBL4224043)
IC50
>50000±n/a nM
Citation
 Chance, JPFejzic, HHernandez, OIstvan, ESAndaya, AMaslov, NAispuro, RCrisanto, TNguyen, HVidal, BSerrano, WKuwahara, BPugne Andanado, CGoldberg, DEMallari, JP Development of piperazine-based hydroxamic acid inhibitors against falcilysin, an essential malarial protease. Bioorg Med Chem Lett 28:1846-1848 (2018)  
Target
Name:
Falcilysin
Synonyms:
3.4.24.- | Falcilysin
Type:
PROTEIN
Mol. Mass.:
138868.64
Organism:
Plasmodium falciparum (isolate 3D7)
Description:
ChEMBL_118121
Residue:
1193
  
Inhibitor
Name:
BDBM50461719
Synonyms:
CHEMBL4226235
Type:
Small organic molecule
Emp. Form.:
C14H21N3O5S
Mol. Mass.:
343.399
SMILES:
OCCCN1CCN(C(C1)C(=O)NO)S(=O)(=O)c1ccccc1
: