Target
Dual specificity protein kinase CLK2
Ligand
BDBM50335638
Substrate
Meas. Tech.
ChEMBL_1772295 (CHEMBL4224407)
IC50
3.8±n/a nM
Citation
 Brear, PNorth, AIegre, JHadje Georgiou, KLubin, ACarro, LGreen, WSore, HFHyvönen, MSpring, DR Novel non-ATP competitive small molecules targeting the CK2 ?/? interface. Bioorg Med Chem 26:3016-3020 (2018)  
Target
Name:
Dual specificity protein kinase CLK2
Synonyms:
2.7.12.1 CDC-like kinase 2 (CLK2) CLK2 | CLK2_HUMAN
Type:
Mol. Mass.:
60128.79
Organism:
Homo sapiens (Human)
Description:
P49760
Residue:
499
  
Inhibitor
Name:
BDBM50335638
Synonyms:
5-(3-Chlorophenylamino)benzo[c][2,6]naphthyridine-8-carboxylic acid CHEMBL1230165 US9062043, Table 13, Compound 17 | US9062043, Table 20b, Compound 12
Type:
Small organic molecule
Emp. Form.:
C19H12ClN3O2
Mol. Mass.:
349.77
SMILES:
OC(=O)c1ccc2c(c1)nc(Nc1cccc(Cl)c1)c1ccncc21
: