Target
D(2) dopamine receptor
Ligand
BDBM50462155
Substrate
Meas. Tech.
ChEMBL_1772846 (CHEMBL4229838)
Ki
0.300000±n/a nM
Citation
 Zajdel, PKos, TMarciniec, KSata?a, GCanale, VKami?ski, KHo?uj, MLenda, TKoralewski, RBednarski, MNowi?ski, LWójcikowski, JDaniel, WANikiforuk, ANalepa, IChmielarz, PKu?mierczyk, JBojarski, AJPopik, P Novel multi-target azinesulfonamides of cyclic amine derivatives as potential antipsychotics with pro-social and pro-cognitive effects. Eur J Med Chem 145:790-804 (2018)  
Target
Name:
D(2) dopamine receptor
Synonyms:
D(2) dopamine receptor DOPAMINE D2 Long DRD2 Dopamine D2 receptor Dopamine D2 receptor (D2R) Dopamine2-like | d2
Type:
Cell-surface receptors
Mol. Mass.:
50647.10
Organism:
Homo sapiens (Human)
Description:
P14416
Residue:
443
  
Inhibitor
Name:
BDBM50462155
Synonyms:
CHEMBL4239091
Type:
Small organic molecule
Emp. Form.:
C26H29N5O2S2
Mol. Mass.:
507.671
SMILES:
O=S(=O)(N1CCC[C@@H]1CCN1CCN(CC1)c1nsc2ccccc12)c1cccc2cnccc12
: