Target
Serine/threonine-protein kinase B-raf
Ligand
BDBM99471
Substrate
Meas. Tech.
ChEMBL_1775598 (CHEMBL4232590)
IC50
4.5±n/a nM
Citation
 Grasso, MEstrada, MABerrios, KNWinkler, JDMarmorstein, R N-(7-Cyano-6-(4-fluoro-3-(2-(3-(trifluoromethyl)phenyl)acetamido)phenoxy)benzo[d]thiazol-2-yl)cyclopropanecarboxamide (TAK632) Promotes Inhibition of BRAF through the Induction of Inhibited Dimers. J Med Chem 61:5034-5046 (2018)  
Target
Name:
Serine/threonine-protein kinase B-raf
Synonyms:
B-RAF B-Raf proto-oncogene serine/threonine-protein kinase BRAF1 RAFB1 v-Raf murine sarcoma viral oncogene homolog B1
Type:
Serine/threonine-protein kinase
Mol. Mass.:
84446.00
Organism:
Homo sapiens (Human)
Description:
P15056
Residue:
766
  
Inhibitor
Name:
BDBM99471
Synonyms:
US8497274, 32
Type:
Small organic molecule
Emp. Form.:
C27H18F4N4O3S
Mol. Mass.:
554.515
SMILES:
Fc1ccc(Oc2ccc3nc(NC(=O)C4CC4)sc3c2C#N)cc1NC(=O)Cc1cccc(c1)C(F)(F)F
: