Target
Prostaglandin G/H synthase 2
Ligand
BDBM54705
Substrate
Meas. Tech.
ChEMBL_1776567 (CHEMBL4233559)
IC50
26300±n/a nM
Citation
 Navarro, LRosell, GSánchez, SBoixareu, NPors, KPouplana, RCampanera, JMPujol, MD Synthesis and biological properties of aryl methyl sulfones. Bioorg Med Chem 26:4113-4126 (2018)  
Target
Name:
Prostaglandin G/H synthase 2
Synonyms:
COX2 Cyclooxygenase-2 (COX-2) PTGS2 Prostaglandin G/H synthase (cyclooxygenase)
Type:
Protein
Mol. Mass.:
68976.98
Organism:
Ovis aries (Sheep)
Description:
Residue:
603
  
Inhibitor
Name:
BDBM54705
Synonyms:
CHEMBL1297 UNM-0000306101 calcium;2-(3-phenoxyphenyl)propionic acid;hydrate | cid_16219353
Type:
Small organic molecule
Emp. Form.:
C15H14O3
Mol. Mass.:
242.2699
SMILES:
CC(C(O)=O)c1cccc(Oc2ccccc2)c1
: