Target
Urease subunit beta
Ligand
BDBM50099857
Substrate
Meas. Tech.
ChEMBL_1776582 (CHEMBL4233574)
IC50
108000±n/a nM
Citation
 Ni, WWLiu, QRen, SZLi, WYYi, LLJing, HSheng, LXWan, QZhong, PFFang, HLOuyang, HXiao, ZPZhu, HL The synthesis and evaluation of phenoxyacylhydroxamic acids as potential agents for Helicobacter pylori infections. Bioorg Med Chem 26:4145-4152 (2018)  
Target
Name:
Urease subunit beta
Synonyms:
3.5.1.5 Urea amidohydrolase subunit beta hpuB | ureB
Type:
PROTEIN
Mol. Mass.:
61676.43
Organism:
Helicobacter pylori (strain ATCC 700392 / 26695) (Campylobacterpylori)
Description:
ChEMBL_117195
Residue:
569
  
Inhibitor
Name:
BDBM50099857
Synonyms:
ACETOHYDROXAMIC ACID (AHA) Acethydroxamsaeure Acetic acid, oxime Cetohyroxamic acid Methylhydroxamic acid N-Acetylhydroxylamine acetohydroxamic acid
Type:
Small organic molecule
Emp. Form.:
C2H5NO2
Mol. Mass.:
75.0666
SMILES:
CC(=O)NO
: