Target
Urease subunit beta
Ligand
BDBM50462868
Substrate
Meas. Tech.
ChEMBL_1776586 (CHEMBL4233578)
Ki
43±n/a nM
Citation
 Ni, WWLiu, QRen, SZLi, WYYi, LLJing, HSheng, LXWan, QZhong, PFFang, HLOuyang, HXiao, ZPZhu, HL The synthesis and evaluation of phenoxyacylhydroxamic acids as potential agents for Helicobacter pylori infections. Bioorg Med Chem 26:4145-4152 (2018)  
Target
Name:
Urease subunit beta
Synonyms:
3.5.1.5 Urea amidohydrolase subunit beta hpuB | ureB
Type:
PROTEIN
Mol. Mass.:
61676.43
Organism:
Helicobacter pylori (strain ATCC 700392 / 26695) (Campylobacterpylori)
Description:
ChEMBL_117195
Residue:
569
  
Inhibitor
Name:
BDBM50462868
Synonyms:
CHEMBL4251246
Type:
Small organic molecule
Emp. Form.:
C9H10ClNO3
Mol. Mass.:
215.634
SMILES:
ONC(=O)CCOc1ccc(Cl)cc1
: