Target
Cathepsin S
Ligand
BDBM50463225
Substrate
Meas. Tech.
ChEMBL_1777935 (CHEMBL4234927)
IC50
200±n/a nM
Citation
 Tber, ZWartenberg, MJacques, JERoy, VLecaille, FWarszycki, DBojarski, AJLalmanach, GAgrofoglio, LA Selective inhibition of human cathepsin S by 2,4,6-trisubstituted 1,3,5-triazine analogs. Bioorg Med Chem 26:4310-4319 (2018)  
Target
Name:
Cathepsin S
Synonyms:
CATS_HUMAN Cathepsin S (Cat S) | cathepsin S preproprotein
Type:
Protein
Mol. Mass.:
37507.38
Organism:
Homo sapiens (Human)
Description:
P25774
Residue:
331
  
Inhibitor
Name:
BDBM50463225
Synonyms:
CHEMBL4247983
Type:
Small organic molecule
Emp. Form.:
C16H19N7O
Mol. Mass.:
325.3684
SMILES:
COc1cccc(Nc2nc(NC3CCNCC3)nc(n2)C#N)c1
: