Target
Cathepsin S
Ligand
BDBM50463223
Substrate
Meas. Tech.
ChEMBL_1777935 (CHEMBL4234927)
IC50
10.0±n/a nM
Citation
 Tber, ZWartenberg, MJacques, JERoy, VLecaille, FWarszycki, DBojarski, AJLalmanach, GAgrofoglio, LA Selective inhibition of human cathepsin S by 2,4,6-trisubstituted 1,3,5-triazine analogs. Bioorg Med Chem 26:4310-4319 (2018)  
Target
Name:
Cathepsin S
Synonyms:
CATS_HUMAN Cathepsin S (Cat S) | cathepsin S preproprotein
Type:
Protein
Mol. Mass.:
37507.38
Organism:
Homo sapiens (Human)
Description:
P25774
Residue:
331
  
Inhibitor
Name:
BDBM50463223
Synonyms:
CHEMBL4237391
Type:
Small organic molecule
Emp. Form.:
C15H16N8O2
Mol. Mass.:
340.3399
SMILES:
[O-][N+](=O)c1cccc(Nc2nc(NC3CCNCC3)nc(n2)C#N)c1
: