Target
Cathepsin K
Ligand
BDBM50463231
Substrate
Meas. Tech.
ChEMBL_1777933 (CHEMBL4234925)
IC50
30±n/a nM
Citation
 Tber, ZWartenberg, MJacques, JERoy, VLecaille, FWarszycki, DBojarski, AJLalmanach, GAgrofoglio, LA Selective inhibition of human cathepsin S by 2,4,6-trisubstituted 1,3,5-triazine analogs. Bioorg Med Chem 26:4310-4319 (2018)  
Target
Name:
Cathepsin K
Synonyms:
CATK_HUMAN CTSO Cathepsin O Cathepsin X
Type:
Enzyme
Mol. Mass.:
36975.68
Organism:
Homo sapiens (Human)
Description:
P43235
Residue:
329
  
Inhibitor
Name:
BDBM50463231
Synonyms:
CHEMBL4249139
Type:
Small organic molecule
Emp. Form.:
C14H13FN6O
Mol. Mass.:
300.291
SMILES:
Fc1ccc(Nc2nc(nc(n2)N2CCOCC2)C#N)cc1
: