Target
Cathepsin B
Ligand
BDBM50463221
Substrate
Meas. Tech.
ChEMBL_1777936 (CHEMBL4234928)
Ki
>500000±n/a nM
Citation
 Tber, ZWartenberg, MJacques, JERoy, VLecaille, FWarszycki, DBojarski, AJLalmanach, GAgrofoglio, LA Selective inhibition of human cathepsin S by 2,4,6-trisubstituted 1,3,5-triazine analogs. Bioorg Med Chem 26:4310-4319 (2018)  
Target
Name:
Cathepsin B
Synonyms:
APP secretase CATB_HUMAN CTSB Cathepsin B light chain | Cathepsin B1
Type:
Enzyme
Mol. Mass.:
37819.69
Organism:
Homo sapiens (Human)
Description:
gi_63102437
Residue:
339
  
Inhibitor
Name:
BDBM50463221
Synonyms:
CHEMBL4251253
Type:
Small organic molecule
Emp. Form.:
C15H13F3N6O2
Mol. Mass.:
366.2979
SMILES:
FC(F)(F)Oc1ccc(Nc2nc(nc(n2)N2CCOCC2)C#N)cc1
: