Target
Kinesin-like protein KIF11
Ligand
BDBM50463302
Substrate
Meas. Tech.
ChEMBL_1777997 (CHEMBL4234989)
IC50
0.200000±n/a nM
Citation
 Khathi, SPChandrasekaran, BKarunanidhi, STham, CLKozielski, FSayyad, NKarpoormath, R Design and synthesis of novel thiadiazole-thiazolone hybrids as potential inhibitors of the human mitotic kinesin Eg5. Bioorg Med Chem Lett 28:2930-2938 (2018)  
Target
Name:
Kinesin-like protein KIF11
Synonyms:
EG5 KIF11_HUMAN Kinesin Spindle Protein Eg5 TRIP5 | kinesin spindle protein
Type:
PROTEIN
Mol. Mass.:
119138.97
Organism:
Homo sapiens (Human)
Description:
ChEMBL_1457426
Residue:
1056
  
Inhibitor
Name:
BDBM50463302
Synonyms:
CHEMBL4239814
Type:
Small organic molecule
Emp. Form.:
C23H28FN3O
Mol. Mass.:
381.4863
SMILES:
CN(C)CCC[C@@]1(CN(N=C1C(C)=O)c1cc(C)ccc1F)c1ccccc1
: