Target
Cannabinoid receptor 1
Ligand
BDBM50463405
Substrate
Meas. Tech.
ChEMBL_1778204 (CHEMBL4235196)
Ki
3.0±n/a nM
Citation
 Amato, GSManke, AVasukuttan, VWiethe, RWSnyder, RWRunyon, SPMaitra, R Synthesis and pharmacological characterization of functionalized 6-piperazin-1-yl-purines as cannabinoid receptor 1 (CB1) inverse agonists. Bioorg Med Chem 26:4518-4531 (2018)  
Target
Name:
Cannabinoid receptor 1
Synonyms:
CANN6 CB-R CNR CNR1_HUMAN Cannabinoid receptor Cannabinoid receptor 1 (brain)
Type:
G Protein-Coupled Receptor (GPCR)
Mol. Mass.:
52868.96
Organism:
Homo sapiens (Human)
Description:
P21554
Residue:
472
  
Inhibitor
Name:
BDBM50463405
Synonyms:
CHEMBL4237943
Type:
Small organic molecule
Emp. Form.:
C26H24Cl2N6O2
Mol. Mass.:
523.414
SMILES:
Clc1ccc(cc1)-n1c(nc2c(ncnc12)N1CCN(CC1)C(=O)OC1CCC1)-c1ccccc1Cl
: