Target
Cannabinoid receptor 1
Ligand
BDBM50463425
Substrate
Meas. Tech.
ChEMBL_1778204 (CHEMBL4235196)
Ki
3.0±n/a nM
Citation
 Amato, GSManke, AVasukuttan, VWiethe, RWSnyder, RWRunyon, SPMaitra, R Synthesis and pharmacological characterization of functionalized 6-piperazin-1-yl-purines as cannabinoid receptor 1 (CB1) inverse agonists. Bioorg Med Chem 26:4518-4531 (2018)  
Target
Name:
Cannabinoid receptor 1
Synonyms:
CANN6 CB-R CNR CNR1_HUMAN Cannabinoid receptor Cannabinoid receptor 1 (brain)
Type:
G Protein-Coupled Receptor (GPCR)
Mol. Mass.:
52868.96
Organism:
Homo sapiens (Human)
Description:
P21554
Residue:
472
  
Inhibitor
Name:
BDBM50463425
Synonyms:
CHEMBL4249388
Type:
Small organic molecule
Emp. Form.:
C30H26Cl2N6O
Mol. Mass.:
557.473
SMILES:
CC(C(=O)N1CCN(CC1)c1ncnc2n(c(nc12)-c1ccccc1Cl)-c1ccc(Cl)cc1)c1ccccc1
: