Target
Cannabinoid receptor 1
Ligand
BDBM50463402
Substrate
Meas. Tech.
ChEMBL_1778204 (CHEMBL4235196)
Ki
3.0±n/a nM
Citation
 Amato, GSManke, AVasukuttan, VWiethe, RWSnyder, RWRunyon, SPMaitra, R Synthesis and pharmacological characterization of functionalized 6-piperazin-1-yl-purines as cannabinoid receptor 1 (CB1) inverse agonists. Bioorg Med Chem 26:4518-4531 (2018)  
Target
Name:
Cannabinoid receptor 1
Synonyms:
CANN6 CB-R CNR CNR1_HUMAN Cannabinoid receptor Cannabinoid receptor 1 (brain)
Type:
G Protein-Coupled Receptor (GPCR)
Mol. Mass.:
52868.96
Organism:
Homo sapiens (Human)
Description:
P21554
Residue:
472
  
Inhibitor
Name:
BDBM50463402
Synonyms:
CHEMBL4245443
Type:
Small organic molecule
Emp. Form.:
C27H28Cl2N6O3S
Mol. Mass.:
587.521
SMILES:
Clc1ccc(cc1)-n1c(nc2c(ncnc12)N1CCN(CC1)S(=O)(=O)CC1CCOCC1)-c1ccccc1Cl
: