Target
Cannabinoid receptor 1
Ligand
BDBM50463415
Substrate
Meas. Tech.
ChEMBL_1778204 (CHEMBL4235196)
Ki
5.0±n/a nM
Citation
 Amato, GSManke, AVasukuttan, VWiethe, RWSnyder, RWRunyon, SPMaitra, R Synthesis and pharmacological characterization of functionalized 6-piperazin-1-yl-purines as cannabinoid receptor 1 (CB1) inverse agonists. Bioorg Med Chem 26:4518-4531 (2018)  
Target
Name:
Cannabinoid receptor 1
Synonyms:
CANN6 CB-R CNR CNR1_HUMAN Cannabinoid receptor Cannabinoid receptor 1 (brain)
Type:
G Protein-Coupled Receptor (GPCR)
Mol. Mass.:
52868.96
Organism:
Homo sapiens (Human)
Description:
P21554
Residue:
472
  
Inhibitor
Name:
BDBM50463415
Synonyms:
CHEMBL4238830
Type:
Small organic molecule
Emp. Form.:
C28H21Cl2F2N7O
Mol. Mass.:
580.415
SMILES:
Fc1ccc(NC(=O)N2CCN(CC2)c2ncnc3n(c(nc23)-c2ccccc2Cl)-c2ccc(Cl)cc2)cc1F
: