Target
Ceramide kinase
Ligand
BDBM50463479
Substrate
Meas. Tech.
ChEMBL_1778339 (CHEMBL4235331)
Ki
>10000±n/a nM
Citation
 Bandarage, UKCao, JCome, JHCourt, JJGao, HJacobs, MDMarhefka, CNanthakumar, SGreen, J ROCK inhibitors 3: Design, synthesis and structure-activity relationships of 7-azaindole-based Rho kinase (ROCK) inhibitors. Bioorg Med Chem Lett 28:2622-2626 (2018)  
Target
Name:
Ceramide kinase
Synonyms:
Acylsphingosine kinase CERK1_HUMAN LK4 hCERK
Type:
PROTEIN
Mol. Mass.:
59996.47
Organism:
Homo sapiens (Human)
Description:
ChEMBL_742032
Residue:
537
  
Inhibitor
Name:
BDBM50463479
Synonyms:
CHEMBL4249925
Type:
Small organic molecule
Emp. Form.:
C19H17N5O3S2
Mol. Mass.:
427.5
SMILES:
CS(=O)(=O)Nc1cccc(CC(=O)Nc2nc(cs2)-c2c[nH]c3ncccc23)c1
: