Target
Ceramide kinase
Ligand
BDBM50463484
Substrate
Meas. Tech.
ChEMBL_1778339 (CHEMBL4235331)
Ki
>10000±n/a nM
Citation
 Bandarage, UKCao, JCome, JHCourt, JJGao, HJacobs, MDMarhefka, CNanthakumar, SGreen, J ROCK inhibitors 3: Design, synthesis and structure-activity relationships of 7-azaindole-based Rho kinase (ROCK) inhibitors. Bioorg Med Chem Lett 28:2622-2626 (2018)  
Target
Name:
Ceramide kinase
Synonyms:
Acylsphingosine kinase CERK1_HUMAN LK4 hCERK
Type:
PROTEIN
Mol. Mass.:
59996.47
Organism:
Homo sapiens (Human)
Description:
ChEMBL_742032
Residue:
537
  
Inhibitor
Name:
BDBM50463484
Synonyms:
CHEMBL4248525
Type:
Small organic molecule
Emp. Form.:
C26H30N6O2S
Mol. Mass.:
490.62
SMILES:
CN1CCN(CCCOc2cccc(CC(=O)Nc3nc(cs3)-c3c[nH]c4ncccc34)c2)CC1
: